BDBM50283477 CHEMBL4169009
SMILES COc1ccc(cc1C)-c1c(C)nn2c(cc(C)nc12)C(F)(F)F
InChI Key InChIKey=FAJJUFIIPFKHQD-UHFFFAOYSA-N
Data  2 EC50
  Tab Delimited (TSV)   2D SDfile   Computed 3D by Vconf -m prep SDfile
Find this compound or compounds like it in BindingDB:
Activity Spreadsheet -- Enzyme Inhibition Constant Data from BindingDB
Found 2 hits for monomerid = 50283477
TargetMetabotropic glutamate receptor 7(Rattus norvegicus (Rat))
Vanderbilt University
Curated by ChEMBL
LigandPNGBDBM50283477(CHEMBL4169009)
Affinity DataEC50:  3.00E+3nM. Assay description: Positive allosteric modulation of rat mGlu7 receptor expressed in HEK cells co-expressing Galphai5 assessed as increase in glutamate-induced calcium ...
In DepthDetails ArticlePubMed
TargetMetabotropic glutamate receptor 7(Rattus norvegicus (Rat))
Vanderbilt University
Curated by ChEMBL
LigandPNGBDBM50283477(CHEMBL4169009)
Affinity DataEC50:  2.95E+3nM. Assay description: Positive allosteric modulation of rat mGlu7 receptor expressed in HEK cells co-expressing Galphai5 assessed as increase in glutamate-induced calcium ...
In DepthDetails ArticlePubMed